Target
Mitogen-activated protein kinase 1
Ligand
BDBM50601918
Substrate
Meas. Tech.
ChEMBL_2238584 (CHEMBL5152480)
Ki
0.064000±n/a nM
Citation
 Fu, LChen, SHe, GChen, YLiu, B Targeting Extracellular Signal-Regulated Protein Kinase 1/2 (ERK1/2) in Cancer: An Update on Pharmacological Small-Molecule Inhibitors. J Med Chem 65:13561-13573 (2022) Target
Name:
Mitogen-activated protein kinase 1
Synonyms:
ERK2 Extracellular signal-regulated kinase 2 Extracellular signal-regulated kinase 2 (ERK2) MAPK 2 MK01_HUMAN Mitogen-activated protein kinase 1 (ERK-2) Mitogen-activated protein kinase 2 PRKM2 | p42-MAPK
Type:
Ser/Thr Protein Kinase
Mol. Mass.:
41392.76
Organism:
Homo sapiens (Human)
Description:
P28482
Residue:
360
  
Inhibitor
Name:
BDBM50601918
Synonyms:
LY-3214996 Ly 3214996 TEMUTERKIB [14c]-ly3214996
Type:
Small organic molecule
Emp. Form.:
C22H27N7O2S
Mol. Mass.:
453.56
SMILES:
Cn1nccc1Nc1nccc(n1)-c1cc2C(=O)N(CCN3CCOCC3)C(C)(C)c2s1
: