Target
Urease subunit beta
Ligand
BDBM50602006
Substrate
Meas. Tech.
ChEMBL_2238960 (CHEMBL5152856)
Ki
65±n/a nM
Citation
 Song, WQLiu, MLYuan, LCLi, SYWang, YNXiao, ZPZhu, HL Synthesis, evaluation and mechanism exploration of 2-(N-(3-nitrophenyl)-N-phenylsulfonyl)aminoacetohydroxamic acids as novel urease inhibitors. Bioorg Med Chem Lett 78:0 (2022) Target
Name:
Urease subunit beta
Synonyms:
3.5.1.5 Urea amidohydrolase subunit beta hpuB | ureB
Type:
PROTEIN
Mol. Mass.:
61676.43
Organism:
Helicobacter pylori (strain ATCC 700392 / 26695) (Campylobacterpylori)
Description:
ChEMBL_117195
Residue:
569
  
Inhibitor
Name:
BDBM50602006
Synonyms:
CHEMBL5209436
Type:
Small organic molecule
Emp. Form.:
C14H12BrN3O6S
Mol. Mass.:
430.231
SMILES:
ONC(=O)CN(c1cccc(c1)[N+]([O-])=O)S(=O)(=O)c1ccc(Br)cc1
: