Target
GABA-A receptor; alpha-2/beta-3/gamma-2
Ligand
BDBM50179995
Substrate
Meas. Tech.
ChEMBL_333416 (CHEMBL853070)
Ki
0.4±n/a nM
Citation
 Russell, MGCarling, RWStreet, LJHallett, DJGoodacre, SMezzogori, EReader, MCook, SMBromidge, FANewman, RSmith, AJWafford, KAMarshall, GRReynolds, DSDias, RFerris, PStanley, JLincoln, RTye, SJSheppard, WFSohal, BPike, ADominguez, MAtack, JRCastro, JL Discovery of imidazo[1,2-b][1,2,4]triazines as GABA(A) alpha2/3 subtype selective agonists for the treatment of anxiety. J Med Chem 49:1235-8 (2006)  
Target
Name:
GABA-A receptor; alpha-2/beta-3/gamma-2
Synonyms:
GABA receptor alpha-2/beta-3/gamma-2 subunit | Gamma-aminobutyric acid receptor subunit alpha-2/beta-3/gamma-2
Type:
Mol. Mass.:
Description:
ASSAY_ID of ChEMBL is 2148174
Components:
This complex has 3 components.
Component 1
Name:
Gamma-aminobutyric acid receptor subunit gamma-2
Synonyms:
GABA(A) receptor subunit gamma-2 GBRG2_HUMAN
Type:
PROTEIN
Mol. Mass.:
54172.74
Organism:
Homo sapiens (Human)
Description:
EBI_217
Residue:
467
  
Component 2
Name:
Gamma-aminobutyric acid receptor subunit beta-3
Synonyms:
GABA A receptor alpha-4/beta-3/gamma-2 GABA-A receptor GBRB3_HUMAN | agonist GABA site
Type:
PROTEIN
Mol. Mass.:
54130.51
Organism:
Homo sapiens (Human)
Description:
ChEMBL_448071
Residue:
473
  
Component 3
Name:
Gamma-aminobutyric acid receptor subunit alpha-2
Synonyms:
GABA receptor alpha-2 subunit GBRA2_HUMAN | Gamma-aminobutyric acid receptor subunit alpha-2 (GABRA2)
Type:
Protein
Mol. Mass.:
51338.78
Organism:
Homo sapiens (Human)
Description:
P47869
Residue:
451
  
Inhibitor
Name:
BDBM50179995
Synonyms:
3'-(7-methyl-imidazo[1,2-a]pyrimidin-3-yl)-biphenyl-2-carbonitrile CHEMBL199957
Type:
Small organic molecule
Emp. Form.:
C20H14N4
Mol. Mass.:
310.352
SMILES:
Cc1ccn2c(cnc2n1)-c1cccc(c1)-c1ccccc1C#N
: