Target
Polyunsaturated fatty acid lipoxygenase ALOX15
Ligand
BDBM50182508
Substrate
Meas. Tech.
ChEMBL_332671 (CHEMBL858929)
IC50
>50000±n/a nM
Citation
 Kenyon, VChorny, ICarvajal, WJHolman, TRJacobson, MP Novel human lipoxygenase inhibitors discovered using virtual screening with homology models. J Med Chem 49:1356-63 (2006)  
Target
Name:
Polyunsaturated fatty acid lipoxygenase ALOX15
Synonyms:
15-Lipoxygenase-1 (15-LOX-1) Arachidonate 15-lipoxygenase LOG15 Reticulocyte 15-lipoxygenase-1 | Sphingosine 1-phosphate receptor 1 (S1P1)
Type:
Protein
Mol. Mass.:
74804.05
Organism:
Homo sapiens (Human)
Description:
Residue:
662
  
Inhibitor
Name:
BDBM50182508
Synonyms:
CHEMBL201191 | ethyl 2-(4-phenylbutanamido)benzoate
Type:
Small organic molecule
Emp. Form.:
C19H21NO3
Mol. Mass.:
311.3749
SMILES:
CCOC(=O)c1ccccc1NC(=O)CCCc1ccccc1
: