Target
Polyunsaturated fatty acid lipoxygenase ALOX12
Ligand
BDBM50182508
Substrate
Meas. Tech.
ChEMBL_332672 (CHEMBL858930)
IC50
>100000±n/a nM
Citation
 Kenyon, VChorny, ICarvajal, WJHolman, TRJacobson, MP Novel human lipoxygenase inhibitors discovered using virtual screening with homology models. J Med Chem 49:1356-63 (2006)  
Target
Name:
Polyunsaturated fatty acid lipoxygenase ALOX12
Synonyms:
12-LOX 12LO Arachidonate 12-lipoxygenase LOG12 Platelet 12-lipoxygenase | Platelet-type lipoxygenase 12
Type:
Protein
Mol. Mass.:
75689.18
Organism:
Homo sapiens (Human)
Description:
P18054
Residue:
663
  
Inhibitor
Name:
BDBM50182508
Synonyms:
CHEMBL201191 | ethyl 2-(4-phenylbutanamido)benzoate
Type:
Small organic molecule
Emp. Form.:
C19H21NO3
Mol. Mass.:
311.3749
SMILES:
CCOC(=O)c1ccccc1NC(=O)CCCc1ccccc1
: