Target
Potassium voltage-gated channel subfamily A member 4
Ligand
BDBM50182587
Substrate
Meas. Tech.
ChEMBL_334899 (CHEMBL861277)
EC50
4800±n/a nM
Citation
 Harvey, AJBaell, JBToovey, NHomerick, DWulff, H A new class of blockers of the voltage-gated potassium channel Kv1.3 via modification of the 4- or 7-position of khellinone. J Med Chem 49:1433-41 (2006)  
Target
Name:
Potassium voltage-gated channel subfamily A member 4
Synonyms:
KCNA4 KCNA4_HUMAN Voltage-gated potassium channel subunit Kv1.4
Type:
PROTEIN
Mol. Mass.:
73234.81
Organism:
Homo sapiens (Human)
Description:
ChEMBL_471773
Residue:
653
  
Inhibitor
Name:
BDBM50182587
Synonyms:
5-acetyl-4-(4'-chloro)benzyloxy-6-hydroxy-7-methoxybenzofuran | CHEMBL382154
Type:
Small organic molecule
Emp. Form.:
C18H15ClO5
Mol. Mass.:
346.762
SMILES:
COc1c(O)c(C(C)=O)c(OCc2ccc(Cl)cc2)c2ccoc12
: