Target
P2Y purinoceptor 14
Ligand
BDBM50456168
Substrate
Meas. Tech.
ChEMBL_2239286 (CHEMBL5153182)
IC50
0.400000±n/a nM
Citation
 Wang, YHZhou, MZYe, TWang, PPLu, RWang, YLLiu, CXXiao, WLi, JYMeng, ZBXu, LLHu, QHJiang, C Discovery of a Series of 5-Amide-1 J Med Chem 65:15967-15990 (2022) Target
Name:
P2Y purinoceptor 14
Synonyms:
GPR105 KIAA0001 P2Y14_HUMAN | Purinergic receptor P2Y14
Type:
PROTEIN
Mol. Mass.:
38991.62
Organism:
Homo sapiens (Human)
Description:
ChEMBL_1502487
Residue:
338
  
Inhibitor
Name:
BDBM50456168
Synonyms:
CHEMBL1800685
Type:
Small organic molecule
Emp. Form.:
C29H24F3NO2
Mol. Mass.:
475.5016
SMILES:
OC(=O)c1cc(-c2ccc(cc2)C2CCNCC2)c2ccc(cc2c1)-c1ccc(cc1)C(F)(F)F
: