Target
Receptor tyrosine-protein kinase erbB-2
Ligand
BDBM50182898
Substrate
Meas. Tech.
ChEMBL_350363 (CHEMBL861551)
IC50
29±n/a nM
Citation
 Waterson, AGStevens, KLReno, MJZhang, YMBoros, EEBouvier, FRastagar, AUehling, DEDickerson, SHReep, BMcDonald, OBWood, ERRusnak, DWAlligood, KJRudolph, SK Alkynyl pyrimidines as dual EGFR/ErbB2 kinase inhibitors. Bioorg Med Chem Lett 16:2419-22 (2006)  
Target
Name:
Receptor tyrosine-protein kinase erbB-2
Synonyms:
2.7.10.1 CD_antigen=CD340 ERBB2_HUMAN FASN/HER2 HER2 MLN19 NEU Proto-oncogene Neu Tyrosine kinase-type cell surface receptor HER2 | p185erbB2
Type:
Mol. Mass.:
137894.47
Organism:
Homo sapiens (Human)
Description:
P04626
Residue:
1255
  
Inhibitor
Name:
BDBM50182898
Synonyms:
CHEMBL206782 | methyl 5-(3-(2-(4-(4-(3-fluorobenzyloxy)-3-chlorophenylamino)pyrimidin-5-yl)ethynyl)phenylamino)-5-oxopentanoate
Type:
Small organic molecule
Emp. Form.:
C31H26ClFN4O4
Mol. Mass.:
573.014
SMILES:
COC(=O)CCCC(=O)Nc1cccc(c1)C#Cc1cncnc1Nc1ccc(OCc2cccc(F)c2)c(Cl)c1
: