Target
Receptor tyrosine-protein kinase erbB-2
Ligand
BDBM50182897
Substrate
Meas. Tech.
ChEMBL_350363 (CHEMBL861551)
IC50
52±n/a nM
Citation
 Waterson, AGStevens, KLReno, MJZhang, YMBoros, EEBouvier, FRastagar, AUehling, DEDickerson, SHReep, BMcDonald, OBWood, ERRusnak, DWAlligood, KJRudolph, SK Alkynyl pyrimidines as dual EGFR/ErbB2 kinase inhibitors. Bioorg Med Chem Lett 16:2419-22 (2006)  
Target
Name:
Receptor tyrosine-protein kinase erbB-2
Synonyms:
2.7.10.1 CD_antigen=CD340 ERBB2_HUMAN FASN/HER2 HER2 MLN19 NEU Proto-oncogene Neu Tyrosine kinase-type cell surface receptor HER2 | p185erbB2
Type:
Mol. Mass.:
137894.47
Organism:
Homo sapiens (Human)
Description:
P04626
Residue:
1255
  
Inhibitor
Name:
BDBM50182897
Synonyms:
CHEMBL207247 | N-(3-(2-(4-(4-(3-fluorobenzyloxy)-3-chlorophenylamino)pyrimidin-5-yl)ethynyl)benzyl)acetamide
Type:
Small organic molecule
Emp. Form.:
C28H22ClFN4O2
Mol. Mass.:
500.951
SMILES:
CC(=O)NCc1cccc(c1)C#Cc1cncnc1Nc1ccc(OCc2cccc(F)c2)c(Cl)c1
: