Target
Receptor tyrosine-protein kinase erbB-2
Ligand
BDBM50182903
Substrate
Meas. Tech.
ChEMBL_350363 (CHEMBL861551)
IC50
780±n/a nM
Citation
 Waterson, AGStevens, KLReno, MJZhang, YMBoros, EEBouvier, FRastagar, AUehling, DEDickerson, SHReep, BMcDonald, OBWood, ERRusnak, DWAlligood, KJRudolph, SK Alkynyl pyrimidines as dual EGFR/ErbB2 kinase inhibitors. Bioorg Med Chem Lett 16:2419-22 (2006)  
Target
Name:
Receptor tyrosine-protein kinase erbB-2
Synonyms:
2.7.10.1 CD_antigen=CD340 ERBB2_HUMAN FASN/HER2 HER2 MLN19 NEU Proto-oncogene Neu Tyrosine kinase-type cell surface receptor HER2 | p185erbB2
Type:
Mol. Mass.:
137894.47
Organism:
Homo sapiens (Human)
Description:
P04626
Residue:
1255
  
Inhibitor
Name:
BDBM50182903
Synonyms:
CHEMBL379093 | N-(4-(3-fluorobenzyloxy)-3-chlorophenyl)-5-(2-phenylethynyl)pyrimidin-4-amine
Type:
Small organic molecule
Emp. Form.:
C25H17ClFN3O
Mol. Mass.:
429.873
SMILES:
Fc1cccc(COc2ccc(Nc3ncncc3C#Cc3ccccc3)cc2Cl)c1
: