Target
Epidermal growth factor receptor
Ligand
BDBM50182905
Substrate
Meas. Tech.
ChEMBL_350362 (CHEMBL861550)
IC50
76±n/a nM
Citation
 Waterson, AGStevens, KLReno, MJZhang, YMBoros, EEBouvier, FRastagar, AUehling, DEDickerson, SHReep, BMcDonald, OBWood, ERRusnak, DWAlligood, KJRudolph, SK Alkynyl pyrimidines as dual EGFR/ErbB2 kinase inhibitors. Bioorg Med Chem Lett 16:2419-22 (2006)  
Target
Name:
Epidermal growth factor receptor
Synonyms:
EGF Receptor Substrate EGFR_HUMAN ERBB1 Epidermal Growth Factor Receptor erbB-1 Epidermal growth factor receptor (EGFR) HER1 Proto-oncogene c-ErbB-1 Tyrosine-Protein Kinase ErbB-1
Type:
Receptor Kinase Domain
Mol. Mass.:
134279.59
Organism:
Homo sapiens (Human)
Description:
P00533
Residue:
1210
  
Inhibitor
Name:
BDBM50182905
Synonyms:
(4-(2-(4-(4-(3-fluorobenzyloxy)-3-chlorophenylamino)pyrimidin-5-yl)ethynyl)thiazol-2-yl)methanol | CHEMBL205047
Type:
Small organic molecule
Emp. Form.:
C23H16ClFN4O2S
Mol. Mass.:
466.915
SMILES:
OCc1nc(cs1)C#Cc1cncnc1Nc1ccc(OCc2cccc(F)c2)c(Cl)c1
: