Target
Epidermal growth factor receptor
Ligand
BDBM50182906
Substrate
Meas. Tech.
ChEMBL_350362 (CHEMBL861550)
IC50
17±n/a nM
Citation
 Waterson, AGStevens, KLReno, MJZhang, YMBoros, EEBouvier, FRastagar, AUehling, DEDickerson, SHReep, BMcDonald, OBWood, ERRusnak, DWAlligood, KJRudolph, SK Alkynyl pyrimidines as dual EGFR/ErbB2 kinase inhibitors. Bioorg Med Chem Lett 16:2419-22 (2006)  
Target
Name:
Epidermal growth factor receptor
Synonyms:
EGF Receptor Substrate EGFR_HUMAN ERBB1 Epidermal Growth Factor Receptor erbB-1 Epidermal growth factor receptor (EGFR) HER1 Proto-oncogene c-ErbB-1 Tyrosine-Protein Kinase ErbB-1
Type:
Receptor Kinase Domain
Mol. Mass.:
134279.59
Organism:
Homo sapiens (Human)
Description:
P00533
Residue:
1210
  
Inhibitor
Name:
BDBM50182906
Synonyms:
CHEMBL205045 | N-(4-(3-fluorobenzyloxy)-3-chlorophenyl)-5-(2-(pyridin-2-yl)ethynyl)pyrimidin-4-amine
Type:
Small organic molecule
Emp. Form.:
C24H16ClFN4O
Mol. Mass.:
430.861
SMILES:
Fc1cccc(COc2ccc(Nc3ncncc3C#Cc3ccccn3)cc2Cl)c1
: