Target
Receptor tyrosine-protein kinase erbB-2
Ligand
BDBM50182905
Substrate
Meas. Tech.
ChEMBL_350363 (CHEMBL861551)
IC50
160±n/a nM
Citation
 Waterson, AGStevens, KLReno, MJZhang, YMBoros, EEBouvier, FRastagar, AUehling, DEDickerson, SHReep, BMcDonald, OBWood, ERRusnak, DWAlligood, KJRudolph, SK Alkynyl pyrimidines as dual EGFR/ErbB2 kinase inhibitors. Bioorg Med Chem Lett 16:2419-22 (2006)  
Target
Name:
Receptor tyrosine-protein kinase erbB-2
Synonyms:
2.7.10.1 CD_antigen=CD340 ERBB2_HUMAN FASN/HER2 HER2 MLN19 NEU Proto-oncogene Neu Tyrosine kinase-type cell surface receptor HER2 | p185erbB2
Type:
Mol. Mass.:
137894.47
Organism:
Homo sapiens (Human)
Description:
P04626
Residue:
1255
  
Inhibitor
Name:
BDBM50182905
Synonyms:
(4-(2-(4-(4-(3-fluorobenzyloxy)-3-chlorophenylamino)pyrimidin-5-yl)ethynyl)thiazol-2-yl)methanol | CHEMBL205047
Type:
Small organic molecule
Emp. Form.:
C23H16ClFN4O2S
Mol. Mass.:
466.915
SMILES:
OCc1nc(cs1)C#Cc1cncnc1Nc1ccc(OCc2cccc(F)c2)c(Cl)c1
: