Target
Receptor tyrosine-protein kinase erbB-2
Ligand
BDBM50182908
Substrate
Meas. Tech.
ChEMBL_350363 (CHEMBL861551)
IC50
9±n/a nM
Citation
 Waterson, AGStevens, KLReno, MJZhang, YMBoros, EEBouvier, FRastagar, AUehling, DEDickerson, SHReep, BMcDonald, OBWood, ERRusnak, DWAlligood, KJRudolph, SK Alkynyl pyrimidines as dual EGFR/ErbB2 kinase inhibitors. Bioorg Med Chem Lett 16:2419-22 (2006)  
Target
Name:
Receptor tyrosine-protein kinase erbB-2
Synonyms:
2.7.10.1 CD_antigen=CD340 ERBB2_HUMAN FASN/HER2 HER2 MLN19 NEU Proto-oncogene Neu Tyrosine kinase-type cell surface receptor HER2 | p185erbB2
Type:
Mol. Mass.:
137894.47
Organism:
Homo sapiens (Human)
Description:
P04626
Residue:
1255
  
Inhibitor
Name:
BDBM50182908
Synonyms:
1-((6-(2-(4-(4-(3-fluorobenzyloxy)-3-chlorophenylamino)pyrimidin-5-yl)ethynyl)pyridin-2-yl)methyl)-3-(2-(methylsulfonyl)ethyl)urea | CHEMBL206029
Type:
Small organic molecule
Emp. Form.:
C29H26ClFN6O4S
Mol. Mass.:
609.071
SMILES:
CS(=O)(=O)CCNC(=O)NCc1cccc(n1)C#Cc1cncnc1Nc1ccc(OCc2cccc(F)c2)c(Cl)c1
: