Target
Receptor tyrosine-protein kinase erbB-2
Ligand
BDBM50182915
Substrate
Meas. Tech.
ChEMBL_350363 (CHEMBL861551)
IC50
66±n/a nM
Citation
 Waterson, AGStevens, KLReno, MJZhang, YMBoros, EEBouvier, FRastagar, AUehling, DEDickerson, SHReep, BMcDonald, OBWood, ERRusnak, DWAlligood, KJRudolph, SK Alkynyl pyrimidines as dual EGFR/ErbB2 kinase inhibitors. Bioorg Med Chem Lett 16:2419-22 (2006)  
Target
Name:
Receptor tyrosine-protein kinase erbB-2
Synonyms:
2.7.10.1 CD_antigen=CD340 ERBB2_HUMAN FASN/HER2 HER2 MLN19 NEU Proto-oncogene Neu Tyrosine kinase-type cell surface receptor HER2 | p185erbB2
Type:
Mol. Mass.:
137894.47
Organism:
Homo sapiens (Human)
Description:
P04626
Residue:
1255
  
Inhibitor
Name:
BDBM50182915
Synonyms:
5-(2-(1H-pyrazol-3-yl)ethynyl)-N-(4-(3-fluorobenzyloxy)-3-chlorophenyl)pyrimidin-4-amine | CHEMBL205284
Type:
Small organic molecule
Emp. Form.:
C22H15ClFN5O
Mol. Mass.:
419.839
SMILES:
Fc1cccc(COc2ccc(Nc3ncncc3C#Cc3ccn[nH]3)cc2Cl)c1
: