Target
Cytochrome P450 2C9
Ligand
BDBM50183224
Substrate
Meas. Tech.
ChEMBL_355284 (CHEMBL853205)
IC50
>5000±n/a nM
Citation
 Mulvihill, MJKan, JLCooke, ABhagwat, SBeck, PBittner, MCesario, CKeane, DLazarescu, VNigro, ANillson, CPanicker, BSmith, VSrebernak, MSun, FLO'Connor, MRusso, SFischetti, GVrkljan, MWinski, SCastelhano, ALEmerson, DGibson, NW 3-[6-(2-Dimethylamino-1-imidazol-1-yl-butyl)-naphthalen-2-yloxy]-2,2-dimethyl-propionic acid as a highly potent and selective retinoic acid metabolic blocking agent. Bioorg Med Chem Lett 16:2729-33 (2006)  
Target
Name:
Cytochrome P450 2C9
Synonyms:
(R)-limonene 6-monooxygenase CP2C9_HUMAN CYP2C9 Cytochrome P450 2C9 (CYP2C9 ) P-450MP P450 PB-1 | S-mephenytoin 4-hydroxylase
Type:
Enzyme
Mol. Mass.:
55636.33
Organism:
Homo sapiens (Human)
Description:
P11712
Residue:
490
  
Inhibitor
Name:
BDBM50183224
Synonyms:
3-[6-(2-dimethylamino-1-imidazol-1-yl-butyl)-naphthalen-2-yloxy]-2,2-dimethyl-propionic acid | CHEMBL208443
Type:
Small organic molecule
Emp. Form.:
C24H31N3O3
Mol. Mass.:
409.5212
SMILES:
CC[C@H]([C@@H](c1ccc2cc(OCC(C)(C)C(O)=O)ccc2c1)n1ccnc1)N(C)C
: