Target
Malonyl-CoA decarboxylase, mitochondrial
Ligand
BDBM50183285
Substrate
Meas. Tech.
ChEMBL_336476 (CHEMBL859660)
IC50
175±n/a nM
Citation
 Cheng, JFChen, MWallace, DTith, SHaramura, MLiu, BMak, CCArrhenius, TReily, SBrown, SThorn, VHarmon, CBarr, RDyck, JRLopaschuk, GDNadzan, AM Synthesis and structure-activity relationship of small-molecule malonyl coenzyme A decarboxylase inhibitors. J Med Chem 49:1517-25 (2006)  
Target
Name:
Malonyl-CoA decarboxylase, mitochondrial
Synonyms:
DCMC_HUMAN Malonyl-CoA decarboxylase
Type:
PROTEIN
Mol. Mass.:
55018.37
Organism:
Homo sapiens (Human)
Description:
ChEMBL_665404
Residue:
493
  
Inhibitor
Name:
BDBM50183285
Synonyms:
CHEMBL205016 | N-ethyl-3-phenyl-N-[4-(2,2,2-trifluoro-1-hydroxy-1-trifluoromethylethyl)phenyl]propionamide
Type:
Small organic molecule
Emp. Form.:
C20H19F6NO2
Mol. Mass.:
419.3608
SMILES:
CCN(C(=O)CCc1ccccc1)c1ccc(cc1)C(O)(C(F)(F)F)C(F)(F)F
: