Target
Sodium-dependent dopamine transporter
Ligand
BDBM50183546
Substrate
Meas. Tech.
ChEMBL_335142 (CHEMBL867622)
Ki
1.3±n/a nM
Citation
 Greiner, EBoos, TLPrisinzano, TEDe Martino, MGZeglis, BDersch, CMMarcus, JPartilla, JSRothman, RBJacobson, AERice, KC Design and synthesis of promiscuous high-affinity monoamine transporter ligands: unraveling transporter selectivity. J Med Chem 49:1766-72 (2006)  
Target
Name:
Sodium-dependent dopamine transporter
Synonyms:
DA transporter DAT1 Dopamine transporter protein (DAT) SC6A3_HUMAN Sodium-dependent dopamine transporter Solute carrier family 6 member 3
Type:
Multi-pass membrane protein
Mol. Mass.:
68497.11
Organism:
Homo sapiens (Human)
Description:
Q01959
Residue:
620
  
Inhibitor
Name:
BDBM50183546
Synonyms:
CHEMBL383071 | S-(+)-4-[2-[bis-(4-fluorophenyl)methoxy]ethyl]-1-(3-phenylbutyl)-piperidine oxalate
Type:
Small organic molecule
Emp. Form.:
C30H35F2NO
Mol. Mass.:
463.6018
SMILES:
C[C@@H](CCN1CCC(CCOC(c2ccc(F)cc2)c2ccc(F)cc2)CC1)c1ccccc1
: