Target
Sodium-dependent dopamine transporter
Ligand
BDBM50183542
Substrate
Meas. Tech.
ChEMBL_335142 (CHEMBL867622)
Ki
1.6±n/a nM
Citation
 Greiner, EBoos, TLPrisinzano, TEDe Martino, MGZeglis, BDersch, CMMarcus, JPartilla, JSRothman, RBJacobson, AERice, KC Design and synthesis of promiscuous high-affinity monoamine transporter ligands: unraveling transporter selectivity. J Med Chem 49:1766-72 (2006)  
Target
Name:
Sodium-dependent dopamine transporter
Synonyms:
DA transporter DAT1 Dopamine transporter protein (DAT) SC6A3_HUMAN Sodium-dependent dopamine transporter Solute carrier family 6 member 3
Type:
Multi-pass membrane protein
Mol. Mass.:
68497.11
Organism:
Homo sapiens (Human)
Description:
Q01959
Residue:
620
  
Inhibitor
Name:
BDBM50183542
Synonyms:
(S)-(-)-4-[2-[bis-(4-fluorophenyl)methoxy]ethyl]-1-(4-phenylbutan-2-ol)-piperidine oxalate | CHEMBL383464
Type:
Small organic molecule
Emp. Form.:
C30H35F2NO2
Mol. Mass.:
479.6012
SMILES:
O[C@@H](CCc1ccccc1)CN1CCC(CCOC(c2ccc(F)cc2)c2ccc(F)cc2)CC1
: