Target
Tyrosine-protein kinase Blk
Ligand
BDBM50602801
Substrate
Meas. Tech.
ChEMBL_2242066 (CHEMBL5156276)
IC50
5.5±n/a nM
Citation
 Fu, TZuo, YZhong, ZChen, XPan, Z Discovery of selective irreversible inhibitors of B-Lymphoid tyrosine kinase (BLK). Eur J Med Chem 229:0 (2022) Target
Name:
Tyrosine-protein kinase Blk
Synonyms:
B lymphoid tyrosine kinase BLK_HUMAN Tyrosine-protein kinase BLK (BLK) | p55-Blk
Type:
Protein
Mol. Mass.:
57711.88
Organism:
Homo sapiens (Human)
Description:
P51451
Residue:
505
  
Inhibitor
Name:
BDBM50602801
Synonyms:
CHEMBL5202420
Type:
Small organic molecule
Emp. Form.:
C36H34N8O3
Mol. Mass.:
626.707
SMILES:
Cc1ccc(NC(=O)c2ccc3cnccc3c2)cc1C(=O)Nc1cnc(Nc2cccc(NC3CCN(CC3)C(=O)C=C)c2)nc1
: