Target
B1 bradykinin receptor
Ligand
BDBM50156455
Substrate
Meas. Tech.
ChEMBL_350974 (CHEMBL858909)
Ki
0.049±n/a nM
Citation
 Kuduk, SDDi Marco, CNChang, RKWood, MRKim, JJSchirripa, KMMurphy, KLRansom, RWTang, CTorrent, MHa, SPrueksaritanont, TPettibone, DJBock, MG 5-Piperazinyl pyridine carboxamide bradykinin B1 antagonists. Bioorg Med Chem Lett 16:2791-5 (2006)  
Target
Name:
B1 bradykinin receptor
Synonyms:
B1 BRADYKININ B1R BK-1 receptor BRADYB1 | Bradykinin B1 receptor
Type:
Enzyme
Mol. Mass.:
40508.87
Organism:
Homo sapiens (Human)
Description:
P46663
Residue:
353
  
Inhibitor
Name:
BDBM50156455
Synonyms:
(R)-N-(4-(4,5-dihydro-1H-imidazol-2-yl)phenethyl)-2-(1-(3,4-dichlorophenylsulfonyl)-3-oxo-1,2,3,4-tetrahydroquinoxalin-2-yl)acetamide CHEMBL189123
Type:
Small organic molecule
Emp. Form.:
C27H25Cl2N5O4S
Mol. Mass.:
586.49
SMILES:
Clc1ccc(cc1Cl)S(=O)(=O)N1[C@H](CC(=O)NCCc2ccc(cc2)C2=NCCN2)C(=O)Nc2ccccc12
: