Target
Thromboxane A2 receptor
Ligand
BDBM50184215
Substrate
Meas. Tech.
ChEMBL_364758 (CHEMBL871220)
Ki
1.7±n/a nM
Citation
 Sturino, CFLachance, NBoyd, MBerthelette, CLabelle, MLi, LRoy, BScheigetz, JTsou, NBrideau, CCauchon, ECarriere, MCDenis, DGreig, GKargman, SLamontagne, SMathieu, MCSawyer, NSlipetz, DO'Neill, GWang, ZZamboni, RMetters, KMYoung, RN Identification of an indole series of prostaglandin D2 receptor antagonists. Bioorg Med Chem Lett 16:3043-8 (2006)  
Target
Name:
Thromboxane A2 receptor
Synonyms:
Prostanoid TP receptor TBXA2R Thromboxane Thromboxane Beta
Type:
Enyzme
Mol. Mass.:
37445.28
Organism:
Homo sapiens (Human)
Description:
P21731
Residue:
343
  
Inhibitor
Name:
BDBM50184215
Synonyms:
2-(9-(4-chlorobenzyl)-6,8-difluoro-2,3,4,9-tetrahydro-1H-carbazol-1-yl)acetic acid | CHEMBL208260
Type:
Small organic molecule
Emp. Form.:
C21H18ClF2NO2
Mol. Mass.:
389.823
SMILES:
OC(=O)CC1CCCc2c1n(Cc1ccc(Cl)cc1)c1c(F)cc(F)cc21
: