Target
Serine/threonine-protein kinase Chk1
Ligand
BDBM50181317
Substrate
Meas. Tech.
ChEMBL_359757 (CHEMBL871263)
IC50
2950±n/a nM
Citation
 Ni, ZJBarsanti, PBrammeier, NDiebes, APoon, DJNg, SPecchi, SPfister, KRenhowe, PARamurthy, SWagman, ASBussiere, DELe, VZhou, YJansen, JMMa, SGesner, TG 4-(Aminoalkylamino)-3-benzimidazole-quinolinones as potent CHK-1 inhibitors. Bioorg Med Chem Lett 16:3121-4 (2006)  
Target
Name:
Serine/threonine-protein kinase Chk1
Synonyms:
CHEK1 CHK1 checkpoint homolog Checkpoint kinase-1 (CHK1)
Type:
Enzyme Catalytic Domain
Mol. Mass.:
54443.02
Organism:
Homo sapiens (Human)
Description:
gi_166295192
Residue:
476
  
Inhibitor
Name:
BDBM50181317
Synonyms:
3-(1H-benzo[d]imidazol-2-yl)-4-hydroxyquinolin-2(1H)-one | CHEMBL377345
Type:
Small organic molecule
Emp. Form.:
C16H11N3O2
Mol. Mass.:
277.2774
SMILES:
Oc1c(-c2nc3ccccc3[nH]2)c(=O)[nH]c2ccccc12
: