Target
Serine/threonine-protein kinase Chk1
Ligand
BDBM50185217
Substrate
Meas. Tech.
ChEMBL_359757 (CHEMBL871263)
IC50
1±n/a nM
Citation
 Ni, ZJBarsanti, PBrammeier, NDiebes, APoon, DJNg, SPecchi, SPfister, KRenhowe, PARamurthy, SWagman, ASBussiere, DELe, VZhou, YJansen, JMMa, SGesner, TG 4-(Aminoalkylamino)-3-benzimidazole-quinolinones as potent CHK-1 inhibitors. Bioorg Med Chem Lett 16:3121-4 (2006)  
Target
Name:
Serine/threonine-protein kinase Chk1
Synonyms:
CHEK1 CHK1 checkpoint homolog Checkpoint kinase-1 (CHK1)
Type:
Enzyme Catalytic Domain
Mol. Mass.:
54443.02
Organism:
Homo sapiens (Human)
Description:
gi_166295192
Residue:
476
  
Inhibitor
Name:
BDBM50185217
Synonyms:
3-(1H-benzo[d]imidazol-2-yl)-6-chloro-4-(piperidin-3-ylamino)quinolin-2(1H)-one | CHEMBL210639
Type:
Small organic molecule
Emp. Form.:
C21H20ClN5O
Mol. Mass.:
393.869
SMILES:
Clc1ccc2[nH]c(=O)c(-c3nc4ccccc4[nH]3)c(NC3CCCNC3)c2c1
: