Target
Serine/threonine-protein kinase Chk1
Ligand
BDBM50185215
Substrate
Meas. Tech.
ChEMBL_359757 (CHEMBL871263)
IC50
7.6±n/a nM
Citation
 Ni, ZJBarsanti, PBrammeier, NDiebes, APoon, DJNg, SPecchi, SPfister, KRenhowe, PARamurthy, SWagman, ASBussiere, DELe, VZhou, YJansen, JMMa, SGesner, TG 4-(Aminoalkylamino)-3-benzimidazole-quinolinones as potent CHK-1 inhibitors. Bioorg Med Chem Lett 16:3121-4 (2006)  
Target
Name:
Serine/threonine-protein kinase Chk1
Synonyms:
CHEK1 CHK1 checkpoint homolog Checkpoint kinase-1 (CHK1)
Type:
Enzyme Catalytic Domain
Mol. Mass.:
54443.02
Organism:
Homo sapiens (Human)
Description:
gi_166295192
Residue:
476
  
Inhibitor
Name:
BDBM50185215
Synonyms:
(S)-3-(1H-benzo[d]imidazol-2-yl)-4-(quinuclidin-3-ylamino)quinolin-2(1H)-one | CHEMBL377554
Type:
Small organic molecule
Emp. Form.:
C23H23N5O
Mol. Mass.:
385.4616
SMILES:
O=c1[nH]c2ccccc2c(N[C@@H]2CN3CCC2CC3)c1-c1nc2ccccc2[nH]1
: