Target
Serine/threonine-protein kinase Chk1
Ligand
BDBM50185225
Substrate
Meas. Tech.
ChEMBL_359757 (CHEMBL871263)
IC50
>30000±n/a nM
Citation
 Ni, ZJBarsanti, PBrammeier, NDiebes, APoon, DJNg, SPecchi, SPfister, KRenhowe, PARamurthy, SWagman, ASBussiere, DELe, VZhou, YJansen, JMMa, SGesner, TG 4-(Aminoalkylamino)-3-benzimidazole-quinolinones as potent CHK-1 inhibitors. Bioorg Med Chem Lett 16:3121-4 (2006)  
Target
Name:
Serine/threonine-protein kinase Chk1
Synonyms:
CHEK1 CHK1 checkpoint homolog Checkpoint kinase-1 (CHK1)
Type:
Enzyme Catalytic Domain
Mol. Mass.:
54443.02
Organism:
Homo sapiens (Human)
Description:
gi_166295192
Residue:
476
  
Inhibitor
Name:
BDBM50185225
Synonyms:
3-(1H-benzo[d]imidazol-2-yl)-4-(diethylamino)quinolin-2(1H)-one | CHEMBL209771
Type:
Small organic molecule
Emp. Form.:
C20H20N4O
Mol. Mass.:
332.399
SMILES:
CCN(CC)c1c(-c2nc3ccccc3[nH]2)c(=O)[nH]c2ccccc12
: