Target
Serine/threonine-protein kinase Chk1
Ligand
BDBM50185221
Substrate
Meas. Tech.
ChEMBL_359757 (CHEMBL871263)
IC50
0.350000±n/a nM
Citation
 Ni, ZJBarsanti, PBrammeier, NDiebes, APoon, DJNg, SPecchi, SPfister, KRenhowe, PARamurthy, SWagman, ASBussiere, DELe, VZhou, YJansen, JMMa, SGesner, TG 4-(Aminoalkylamino)-3-benzimidazole-quinolinones as potent CHK-1 inhibitors. Bioorg Med Chem Lett 16:3121-4 (2006)  
Target
Name:
Serine/threonine-protein kinase Chk1
Synonyms:
CHEK1 CHK1 checkpoint homolog Checkpoint kinase-1 (CHK1)
Type:
Enzyme Catalytic Domain
Mol. Mass.:
54443.02
Organism:
Homo sapiens (Human)
Description:
gi_166295192
Residue:
476
  
Inhibitor
Name:
BDBM50185221
Synonyms:
(S)-3-(1H-benzo[d]imidazol-2-yl)-6-methyl-4-(quinuclidin-3-ylamino)quinolin-2(1H)-one | CHEMBL378967
Type:
Small organic molecule
Emp. Form.:
C24H25N5O
Mol. Mass.:
399.4882
SMILES:
Cc1ccc2[nH]c(=O)c(-c3nc4ccccc4[nH]3)c(N[C@@H]3CN4CCC3CC4)c2c1
: