Target
Cytosolic phospholipase A2
Ligand
BDBM50185351
Substrate
Meas. Tech.
ChEMBL_341908 (CHEMBL863831)
IC50
1000±n/a nM
Citation
 Ludwig, JBovens, SBrauch, CElfringhoff, ASLehr, M Design and synthesis of 1-indol-1-yl-propan-2-ones as inhibitors of human cytosolic phospholipase A2alpha. J Med Chem 49:2611-20 (2006)  
Target
Name:
Cytosolic phospholipase A2
Synonyms:
CPLA2 PA24A_HUMAN PLA2G4A Phospholipase A2 | Phospholipase A2 group IVA
Type:
Protein
Mol. Mass.:
85219.30
Organism:
Homo sapiens (Human)
Description:
P47712
Residue:
749
  
Inhibitor
Name:
BDBM50185351
Synonyms:
3-acetyl-1-(3-(4-octylphenoxy)-2-oxopropyl)-1H-indole-5-carboxylic acid CHEMBL207977
Type:
Small organic molecule
Emp. Form.:
C28H33NO5
Mol. Mass.:
463.5653
SMILES:
CCCCCCCCc1ccc(OCC(=O)Cn2cc(C(C)=O)c3cc(ccc23)C(O)=O)cc1
: