Target
1-deoxy-D-xylulose 5-phosphate reductoisomerase
Ligand
BDBM50185362
Substrate
Meas. Tech.
ChEMBL_344886 (CHEMBL870710)
IC50
>3000±n/a nM
Citation
 Devreux, VWiesner, JGoeman, JLVan der Eycken, JJomaa, HVan Calenbergh, S Synthesis and biological evaluation of cyclopropyl analogues of fosmidomycin as potent Plasmodium falciparum growth inhibitors. J Med Chem 49:2656-60 (2006)  
Target
Name:
1-deoxy-D-xylulose 5-phosphate reductoisomerase
Synonyms:
1-Deoxy-D-xylulose 5-phosphate reductoisomerase (DXP) 1-deoxy-D-xylulose 5-phosphate reductoisomerase (DXR) DXP reductoisomerase dxr yaeM
Type:
Protein
Mol. Mass.:
43384.52
Organism:
Escherichia coli
Description:
P45568
Residue:
398
  
Inhibitor
Name:
BDBM50185362
Synonyms:
(1R,2S)-2-[N-(hydroxy),N-(propionyl)aminomethyl]-cyclopropylphosphonic acid | CHEMBL381270
Type:
Small organic molecule
Emp. Form.:
C7H14NO5P
Mol. Mass.:
223.1635
SMILES:
CCC(=O)N(O)C[C@@H]1C[C@H]1P(O)(O)=O
: