Target
Bromodomain-containing protein 3
Ligand
BDBM50604624
Substrate
Meas. Tech.
ChEMBL_2248315 (CHEMBL5162525)
IC50
5.3±n/a nM
Citation
 Li, JZhang, CXu, HWang, CDong, RShen, HZhuang, XChen, XLi, QLu, JZhang, MWu, XLoomes, KMZhou, YZhang, YLiu, JXu, Y Structure-Based Discovery and Optimization of Furo[3,2- J Med Chem 65:5760-5799 (2022) Target
Name:
Bromodomain-containing protein 3
Synonyms:
BRD3 Bromodomain and extra-terminal motif (BET) Bromodomain-containing protein 3 (BRD3) RING3-like protein | RING3L
Type:
Protein
Mol. Mass.:
79571.81
Organism:
Homo sapiens (Human)
Description:
Q15059
Residue:
726
  
Inhibitor
Name:
BDBM50604624
Synonyms:
CHEMBL5206088
Type:
Small organic molecule
Emp. Form.:
C33H34FN3O4
Mol. Mass.:
555.6392
SMILES:
Cc1cc(F)cc(C)c1Oc1ccc(cc1-c1cn(C)c(=O)c2cc(oc12)-c1cnc([nH]1)C1CCCC1)C(C)(C)O
: