Target
Bromodomain-containing protein 2
Ligand
BDBM50365262
Substrate
Meas. Tech.
ChEMBL_2248316 (CHEMBL5162526)
IC50
3.9±n/a nM
Citation
 Li, JZhang, CXu, HWang, CDong, RShen, HZhuang, XChen, XLi, QLu, JZhang, MWu, XLoomes, KMZhou, YZhang, YLiu, JXu, Y Structure-Based Discovery and Optimization of Furo[3,2- J Med Chem 65:5760-5799 (2022) Target
Name:
Bromodomain-containing protein 2
Synonyms:
BRD2 Bromodomain and extra-terminal motif (BET) Bromodomain-containing protein 2 (BRD2) RING3
Type:
Protein
Mol. Mass.:
88085.95
Organism:
Homo sapiens (Human)
Description:
P25440
Residue:
801
  
Inhibitor
Name:
BDBM50365262
Synonyms:
(+)-JQ1 CHEMBL1957266 US10124009, Compound (S)-JQ1 US10308662, Compound JQ-1 US10617680, Example JQ-1 US10925881, Name (S)-JQ1 US11078188, Example (+)-JQ1 US11427593, Compound JQ1 US9320741, (S)-JQ1 | US9695172, JQ1
Type:
Small organic molecule
Emp. Form.:
C23H25ClN4O2S
Mol. Mass.:
456.988
SMILES:
Cc1nnc2[C@H](CC(=O)OC(C)(C)C)N=C(c3c(C)c(C)sc3-n12)c1ccc(Cl)cc1
: