Target
Bromodomain-containing protein 2
Ligand
BDBM439497
Substrate
Meas. Tech.
ChEMBL_2248316 (CHEMBL5162526)
IC50
0.920000±n/a nM
Citation
 Li, JZhang, CXu, HWang, CDong, RShen, HZhuang, XChen, XLi, QLu, JZhang, MWu, XLoomes, KMZhou, YZhang, YLiu, JXu, Y Structure-Based Discovery and Optimization of Furo[3,2- J Med Chem 65:5760-5799 (2022) Target
Name:
Bromodomain-containing protein 2
Synonyms:
BRD2 Bromodomain and extra-terminal motif (BET) Bromodomain-containing protein 2 (BRD2) RING3
Type:
Protein
Mol. Mass.:
88085.95
Organism:
Homo sapiens (Human)
Description:
P25440
Residue:
801
  
Inhibitor
Name:
BDBM439497
Synonyms:
US10633379, Example 35 | US10633379, Example 82
Type:
Small organic molecule
Emp. Form.:
C28H30FN3O4
Mol. Mass.:
491.5539
SMILES:
CCNC(=O)c1cc2c(cn(C)c(=O)c2[nH]1)-c1cc(ccc1Oc1c(C)cc(F)cc1C)C(C)(C)O
: