Target
Bromodomain-containing protein 2
Ligand
BDBM50604624
Substrate
Meas. Tech.
ChEMBL_2248316 (CHEMBL5162526)
IC50
5.1±n/a nM
Citation
 Li, JZhang, CXu, HWang, CDong, RShen, HZhuang, XChen, XLi, QLu, JZhang, MWu, XLoomes, KMZhou, YZhang, YLiu, JXu, Y Structure-Based Discovery and Optimization of Furo[3,2- J Med Chem 65:5760-5799 (2022) Target
Name:
Bromodomain-containing protein 2
Synonyms:
BRD2 Bromodomain and extra-terminal motif (BET) Bromodomain-containing protein 2 (BRD2) RING3
Type:
Protein
Mol. Mass.:
88085.95
Organism:
Homo sapiens (Human)
Description:
P25440
Residue:
801
  
Inhibitor
Name:
BDBM50604624
Synonyms:
CHEMBL5206088
Type:
Small organic molecule
Emp. Form.:
C33H34FN3O4
Mol. Mass.:
555.6392
SMILES:
Cc1cc(F)cc(C)c1Oc1ccc(cc1-c1cn(C)c(=O)c2cc(oc12)-c1cnc([nH]1)C1CCCC1)C(C)(C)O
: