Target
Macrophage migration inhibitory factor
Ligand
BDBM50186427
Substrate
Meas. Tech.
ChEMBL_369836 (CHEMBL865957)
IC50
6500±n/a nM
Citation
 Cheng, KFAl-Abed, Y Critical modifications of the ISO-1 scaffold improve its potent inhibition of macrophage migration inhibitory factor (MIF) tautomerase activity. Bioorg Med Chem Lett 16:3376-9 (2006)  
Target
Name:
Macrophage migration inhibitory factor
Synonyms:
GIF Glycosylation-inhibiting factor L-dopachrome tautomerase MIF/CD74 (Macrophage migration inhibitory factor and HLA-DR antigens-associated invariant chain) MMIF Macrophage migration inhibitory factor (MIF) | Phenylpyruvate tautomerase
Type:
Enzyme
Mol. Mass.:
12478.18
Organism:
Homo sapiens (Human)
Description:
P14174
Residue:
115
  
Inhibitor
Name:
BDBM50186427
Synonyms:
CHEMBL212313 | methyl 2-(3-(3-fluoro-4-hydroxyphenyl)-4,5-dihydroisoxazol-5-yl)acetate
Type:
Small organic molecule
Emp. Form.:
C12H12FNO4
Mol. Mass.:
253.2264
SMILES:
COC(=O)CC1CC(=NO1)c1ccc(O)c(F)c1
: