Target
Alpha-galactosidase
Ligand
BDBM50186735
Substrate
Meas. Tech.
ChEMBL_353430 (CHEMBL870724)
pH
6.8±n/a
Ki
>1000000±n/a nM
Comments
extracted
Citation
 Wang, RWQiu, XLBols, MOrtega-Caballero, FQing, FL Synthesis and biological evaluation of glycosidase inhibitors: gem-difluoromethylenated nojirimycin analogues. J Med Chem 49:2989-97 (2006)  
Target
Name:
Alpha-galactosidase
Synonyms:
Type:
PROTEIN
Mol. Mass.:
45878.27
Organism:
Coffea arabica
Description:
ChEMBL_353430
Residue:
420
  
Inhibitor
Name:
BDBM50186735
Synonyms:
CHEMBL208021 | D-1,4-dideoxy-4,4-difluoromannonojirimycin
Type:
Small organic molecule
Emp. Form.:
C6H11F2NO3
Mol. Mass.:
183.1532
SMILES:
OC[C@H]1NC[C@@H](O)[C@@H](O)C1(F)F
: