Target
Cell division protein FtsZ
Ligand
BDBM50605152
Substrate
Meas. Tech.
ChEMBL_2250526 (CHEMBL5164736)
Kd
3860±n/a nM
Citation
 Zhong, DXShe, MTGuo, XCZheng, BXHuang, XHZhang, YHSer, HLWong, WLSun, NLu, YJ Design and synthesis of quinolinium-based derivatives targeting FtsZ for antibacterial evaluation and mechanistic study. Eur J Med Chem 236:0 (2022) Target
Name:
Cell division protein FtsZ
Synonyms:
FTSZ_STAAU | ftsZ
Type:
Protein
Mol. Mass.:
41023.36
Organism:
Staphylococcus aureus
Description:
P0A031
Residue:
390
  
Inhibitor
Name:
BDBM50605152
Synonyms:
CHEMBL5186593
Type:
Small organic molecule
Emp. Form.:
C26H32IN3
Mol. Mass.:
513.4568
SMILES:
[I-].CC1CCN(CC1)c1cc(\C=C\c2ccc(cc2)N(C)C)c2ccccc2[n+]1C
: