Target
Thyroid hormone receptor alpha
Ligand
BDBM50605643
Substrate
Meas. Tech.
ChEMBL_2252577 (CHEMBL5166787)
EC50
4.8±n/a nM
Citation
 Li, QYao, BZhao, SLu, ZZhang, YXiang, QWu, XYu, HZhang, CLi, JZhuang, XWu, DLi, YXu, Y Discovery of a Highly Selective and H435R-Sensitive Thyroid Hormone Receptor ? Agonist. J Med Chem 65:7193-7211 (2022) Target
Name:
Thyroid hormone receptor alpha
Synonyms:
C-erbA-alpha EAR7 NR1A1 THA_HUMAN THRA1 Thyroid Hormone Receptor (TR-alpha) Thyroid hormone receptor alpha c-erbA-1
Type:
Receptor
Mol. Mass.:
54818.00
Organism:
Homo sapiens (Human)
Description:
Recombinant hThR was obtained from nuclear extracts from SF9 cells infected with baculovirus vectors encoding for ThRalpha 1.
Residue:
490
  
Inhibitor
Name:
BDBM50605643
Synonyms:
CHEMBL5172845
Type:
Small organic molecule
Emp. Form.:
C20H18N2O6
Mol. Mass.:
382.3667
SMILES:
CCOc1nc(C(=O)NCC(O)=O)c(O)c2ccc(Oc3ccccc3)cc12
: