Target
Protein AF-9
Ligand
BDBM50606143
Substrate
Meas. Tech.
ChEMBL_2253822 (CHEMBL5168032)
Ki
23±n/a nM
Citation
 Yuan, YDu, LTan, RYu, YJiang, JYao, ALuo, JTang, RXiao, YSun, H Design, Synthesis, and Biological Evaluations of DOT1L Peptide Mimetics Targeting the Protein-Protein Interactions between DOT1L and MLL-AF9/MLL-ENL. J Med Chem 65:7770-7785 (2022) Target
Name:
Protein AF-9
Synonyms:
AF9 ALL1-fused gene from chromosome 9 protein Myeloid/lymphoid or mixed-lineage leukemia translocated to chromosome 3 protein YEATS domain-containing protein 3 | YEATS3
Type:
PROTEIN
Mol. Mass.:
63368.78
Organism:
Homo sapiens
Description:
ChEMBL_118006
Residue:
568
  
Inhibitor
Name:
BDBM50606143
Synonyms:
CHEMBL5208460
Type:
Small organic molecule
Emp. Form.:
C47H69N9O6
Mol. Mass.:
856.1075
SMILES:
CC[C@H](C)[C@H](NC(=O)[C@H](CC1CCCC1)NC(=O)[C@H](CN)NC(=O)[C@@H](NC(=O)[C@@H]1CCCN1C(=O)[C@H](CC(C)C)NC(C)=O)C(C)C)c1nc2cccc(-c3ccccc3)c2[nH]1
: