Target
5-hydroxytryptamine receptor 1A
Ligand
BDBM50188477
Substrate
Meas. Tech.
ChEMBL_363787 (CHEMBL860510)
Ki
190±n/a nM
Citation
 Schlotter, KBoeckler, FHübner, HGmeiner, P Fancy bioisosteres: novel paracyclophane derivatives as super-affinity dopamine D3 receptor antagonists. J Med Chem 49:3628-35 (2006)  
Target
Name:
5-hydroxytryptamine receptor 1A
Synonyms:
5-HT-1A 5-hydroxytryptamine receptor 1A (5-HT-1A) ADRB2RL1 Dopamine D2 receptor and serotonin 1a receptor HTR1A | Serotonin receptor 1A
Type:
Mol. Mass.:
46122.49
Organism:
Homo sapiens (Human)
Description:
Residue:
422
  
Inhibitor
Name:
BDBM50188477
Synonyms:
CHEMBL208847 | N-4-(4-(2-methoxyphenyl)piperazin-1-yl)butyl-1(4,7)-benzofurano-4-(1,4)-benzolhexaphanyl-12-carboxamide
Type:
Small organic molecule
Emp. Form.:
C34H39N3O3
Mol. Mass.:
537.6918
SMILES:
COc1ccccc1N1CCN(CCCCNC(=O)c2cc3c4CCc5ccc(CCc(cc4)c3o2)cc5)CC1
: