Target
Receptor-type tyrosine-protein phosphatase beta
Ligand
BDBM50188801
Substrate
Meas. Tech.
ChEMBL_389277 (CHEMBL868027)
IC50
90±n/a nM
Citation
 Amarasinghe, KKEvdokimov, AGEvidokimov, AGXu, KClark, CMMaier, MBSrivastava, AColson, AOGerwe, GSStake, GEHoward, BWPokross, MEGray, JLPeters, KG Design and synthesis of potent, non-peptidic inhibitors of HPTPbeta. Bioorg Med Chem Lett 16:4252-6 (2006)  
Target
Name:
Receptor-type tyrosine-protein phosphatase beta
Synonyms:
PTPB PTPRB_HUMAN R-PTP-beta Receptor-type tyrosine-protein phosphatase beta (PTPβ) Vascular endothelial protein tyrosine phosphatase
Type:
Protein
Mol. Mass.:
224324.80
Organism:
Homo sapiens (Human)
Description:
P23467
Residue:
1997
  
Inhibitor
Name:
BDBM50188801
Synonyms:
CHEMBL213620 | ammonium N-{4-[2-(2-{[(tert-butoxy)carbonyl]amino}ethyl)-3-ethoxy-2-(methoxycarbonyl)-3-oxopropyl]phenyl}sulfamate
Type:
Small organic molecule
Emp. Form.:
C20H29N2O9S
Mol. Mass.:
473.518
SMILES:
CCOC(=O)C(CCNC(=O)OC(C)(C)C)(Cc1ccc(NS([O-])(=O)=O)cc1)C(=O)OC
: