Target
Receptor-type tyrosine-protein phosphatase F
Ligand
BDBM50188779
Substrate
Meas. Tech.
ChEMBL_389282 (CHEMBL868038)
IC50
288000±n/a nM
Citation
 Amarasinghe, KKEvdokimov, AGEvidokimov, AGXu, KClark, CMMaier, MBSrivastava, AColson, AOGerwe, GSStake, GEHoward, BWPokross, MEGray, JLPeters, KG Design and synthesis of potent, non-peptidic inhibitors of HPTPbeta. Bioorg Med Chem Lett 16:4252-6 (2006)  
Target
Name:
Receptor-type tyrosine-protein phosphatase F
Synonyms:
LAR Leukocyte common antigen related (LAR) PTPRF_HUMAN Receptor-type tyrosine-protein phosphatase F (LAR)
Type:
Protein
Mol. Mass.:
212869.85
Organism:
Homo sapiens (Human)
Description:
P10586
Residue:
1907
  
Inhibitor
Name:
BDBM50188779
Synonyms:
CHEMBL378423 | ammonium N-{4-[4-ethoxy-2,2-bis(methoxycarbonyl)-4-oxobutyl]phenyl}sulfamate
Type:
Small organic molecule
Emp. Form.:
C16H20NO9S
Mol. Mass.:
402.397
SMILES:
CCOC(=O)CC(Cc1ccc(NS([O-])(=O)=O)cc1)(C(=O)OC)C(=O)OC
: