Target
Receptor-type tyrosine-protein phosphatase beta
Ligand
BDBM50188791
Substrate
Meas. Tech.
ChEMBL_389277 (CHEMBL868027)
IC50
80±n/a nM
Citation
 Amarasinghe, KKEvdokimov, AGEvidokimov, AGXu, KClark, CMMaier, MBSrivastava, AColson, AOGerwe, GSStake, GEHoward, BWPokross, MEGray, JLPeters, KG Design and synthesis of potent, non-peptidic inhibitors of HPTPbeta. Bioorg Med Chem Lett 16:4252-6 (2006)  
Target
Name:
Receptor-type tyrosine-protein phosphatase beta
Synonyms:
PTPB PTPRB_HUMAN R-PTP-beta Receptor-type tyrosine-protein phosphatase beta (PTPβ) Vascular endothelial protein tyrosine phosphatase
Type:
Protein
Mol. Mass.:
224324.80
Organism:
Homo sapiens (Human)
Description:
P23467
Residue:
1997
  
Inhibitor
Name:
BDBM50188791
Synonyms:
CHEMBL213732 | ammonium N-{4-[2,2-bis(3-methyl-1,2,4-oxadiazol-5-yl)-3-[4-(sulfoamino)phenyl]propyl]phenyl}sulfamate
Type:
Small organic molecule
Emp. Form.:
C21H21N6O8S2
Mol. Mass.:
549.557
SMILES:
Cc1noc(n1)C(Cc1ccc(NS(O)(=O)=O)cc1)(Cc1ccc(NS([O-])(=O)=O)cc1)c1nc(C)no1
: