Target
Receptor-type tyrosine-protein phosphatase beta
Ligand
BDBM50188778
Substrate
Meas. Tech.
ChEMBL_389277 (CHEMBL868027)
IC50
200±n/a nM
Citation
 Amarasinghe, KKEvdokimov, AGEvidokimov, AGXu, KClark, CMMaier, MBSrivastava, AColson, AOGerwe, GSStake, GEHoward, BWPokross, MEGray, JLPeters, KG Design and synthesis of potent, non-peptidic inhibitors of HPTPbeta. Bioorg Med Chem Lett 16:4252-6 (2006)  
Target
Name:
Receptor-type tyrosine-protein phosphatase beta
Synonyms:
PTPB PTPRB_HUMAN R-PTP-beta Receptor-type tyrosine-protein phosphatase beta (PTPβ) Vascular endothelial protein tyrosine phosphatase
Type:
Protein
Mol. Mass.:
224324.80
Organism:
Homo sapiens (Human)
Description:
P23467
Residue:
1997
  
Inhibitor
Name:
BDBM50188778
Synonyms:
CHEMBL213626 | ammonium N-{4-[3-methoxy-2-(methoxycarbonyl)-3-oxo-2-{3-[(1-phenyl-1H-1,2,3,4-tetrazol-5-yl)sulfanyl]propyl}propyl]phenyl}sulfamate
Type:
Small organic molecule
Emp. Form.:
C22H24N5O7S2
Mol. Mass.:
534.586
SMILES:
COC(=O)C(CCCSc1nnnn1-c1ccccc1)(Cc1ccc(NS([O-])(=O)=O)cc1)C(=O)OC
: