Target
Receptor-type tyrosine-protein phosphatase beta
Ligand
BDBM50188779
Substrate
Meas. Tech.
ChEMBL_389277 (CHEMBL868027)
IC50
230±n/a nM
Citation
 Amarasinghe, KKEvdokimov, AGEvidokimov, AGXu, KClark, CMMaier, MBSrivastava, AColson, AOGerwe, GSStake, GEHoward, BWPokross, MEGray, JLPeters, KG Design and synthesis of potent, non-peptidic inhibitors of HPTPbeta. Bioorg Med Chem Lett 16:4252-6 (2006)  
Target
Name:
Receptor-type tyrosine-protein phosphatase beta
Synonyms:
PTPB PTPRB_HUMAN R-PTP-beta Receptor-type tyrosine-protein phosphatase beta (PTPβ) Vascular endothelial protein tyrosine phosphatase
Type:
Protein
Mol. Mass.:
224324.80
Organism:
Homo sapiens (Human)
Description:
P23467
Residue:
1997
  
Inhibitor
Name:
BDBM50188779
Synonyms:
CHEMBL378423 | ammonium N-{4-[4-ethoxy-2,2-bis(methoxycarbonyl)-4-oxobutyl]phenyl}sulfamate
Type:
Small organic molecule
Emp. Form.:
C16H20NO9S
Mol. Mass.:
402.397
SMILES:
CCOC(=O)CC(Cc1ccc(NS([O-])(=O)=O)cc1)(C(=O)OC)C(=O)OC
: