Target
Receptor-type tyrosine-protein phosphatase beta
Ligand
BDBM50188793
Substrate
Meas. Tech.
ChEMBL_389277 (CHEMBL868027)
IC50
300±n/a nM
Citation
 Amarasinghe, KKEvdokimov, AGEvidokimov, AGXu, KClark, CMMaier, MBSrivastava, AColson, AOGerwe, GSStake, GEHoward, BWPokross, MEGray, JLPeters, KG Design and synthesis of potent, non-peptidic inhibitors of HPTPbeta. Bioorg Med Chem Lett 16:4252-6 (2006)  
Target
Name:
Receptor-type tyrosine-protein phosphatase beta
Synonyms:
PTPB PTPRB_HUMAN R-PTP-beta Receptor-type tyrosine-protein phosphatase beta (PTPβ) Vascular endothelial protein tyrosine phosphatase
Type:
Protein
Mol. Mass.:
224324.80
Organism:
Homo sapiens (Human)
Description:
P23467
Residue:
1997
  
Inhibitor
Name:
BDBM50188793
Synonyms:
CHEMBL209957 | ammonium N-{4-[3-methoxy-2-(methoxycarbonyl)-3-oxo-2-[(3-sulfamoylphenyl)methyl]propyl]phenyl}sulfamate
Type:
Small organic molecule
Emp. Form.:
C19H21N2O9S2
Mol. Mass.:
485.509
SMILES:
COC(=O)C(Cc1ccc(NS([O-])(=O)=O)cc1)(Cc1cccc(c1)S(N)(=O)=O)C(=O)OC
: