Target
Receptor-type tyrosine-protein phosphatase beta
Ligand
BDBM50188792
Substrate
Meas. Tech.
ChEMBL_389277 (CHEMBL868027)
IC50
60±n/a nM
Citation
 Amarasinghe, KKEvdokimov, AGEvidokimov, AGXu, KClark, CMMaier, MBSrivastava, AColson, AOGerwe, GSStake, GEHoward, BWPokross, MEGray, JLPeters, KG Design and synthesis of potent, non-peptidic inhibitors of HPTPbeta. Bioorg Med Chem Lett 16:4252-6 (2006)  
Target
Name:
Receptor-type tyrosine-protein phosphatase beta
Synonyms:
PTPB PTPRB_HUMAN R-PTP-beta Receptor-type tyrosine-protein phosphatase beta (PTPβ) Vascular endothelial protein tyrosine phosphatase
Type:
Protein
Mol. Mass.:
224324.80
Organism:
Homo sapiens (Human)
Description:
P23467
Residue:
1997
  
Inhibitor
Name:
BDBM50188792
Synonyms:
CHEMBL213750 | ammonium N-{4-[3-methoxy-2-(methoxycarbonyl)-3-oxo-2-{[4-(sulfoamino)phenyl]methyl}propyl]phenyl}sulfamate
Type:
Small organic molecule
Emp. Form.:
C19H21N2O10S2
Mol. Mass.:
501.508
SMILES:
COC(=O)C(Cc1ccc(NS(O)(=O)=O)cc1)(Cc1ccc(NS([O-])(=O)=O)cc1)C(=O)OC
: