Target
Tyrosine-protein phosphatase non-receptor type 2
Ligand
BDBM50188776
Substrate
Meas. Tech.
ChEMBL_389278 (CHEMBL868029)
IC50
19400±n/a nM
Citation
 Amarasinghe, KKEvdokimov, AGEvidokimov, AGXu, KClark, CMMaier, MBSrivastava, AColson, AOGerwe, GSStake, GEHoward, BWPokross, MEGray, JLPeters, KG Design and synthesis of potent, non-peptidic inhibitors of HPTPbeta. Bioorg Med Chem Lett 16:4252-6 (2006)  
Target
Name:
Tyrosine-protein phosphatase non-receptor type 2
Synonyms:
PTN2_HUMAN PTPT T-cell protein-tyrosine phosphatase TCPTP Tyrosine-protein phosphatase non-receptor type 2 (TC-PTP)
Type:
Protein
Mol. Mass.:
48481.80
Organism:
Homo sapiens (Human)
Description:
P17706
Residue:
415
  
Inhibitor
Name:
BDBM50188776
Synonyms:
4-(2-benzyl-3-methoxy-2-(methoxycarbonyl)-3-oxopropyl)phenylsulfamic acid {4-[2-BENZYL-3-METHOXY-2-(METHOXYCARBONYL)-3-OXOPROPYL]PHENYL}SULFAMIC ACID
Type:
Small organic molecule
Emp. Form.:
C19H21NO7S
Mol. Mass.:
407.438
SMILES:
COC(=O)C(Cc1ccccc1)(Cc1ccc(NS(O)(=O)=O)cc1)C(=O)OC
: