Target
Low molecular weight phosphotyrosine protein phosphatase
Ligand
BDBM50188777
Substrate
Meas. Tech.
ChEMBL_389280 (CHEMBL868036)
IC50
82200±n/a nM
Citation
 Amarasinghe, KKEvdokimov, AGEvidokimov, AGXu, KClark, CMMaier, MBSrivastava, AColson, AOGerwe, GSStake, GEHoward, BWPokross, MEGray, JLPeters, KG Design and synthesis of potent, non-peptidic inhibitors of HPTPbeta. Bioorg Med Chem Lett 16:4252-6 (2006)  
Target
Name:
Low molecular weight phosphotyrosine protein phosphatase
Synonyms:
3.1.3.2 ACP1 LMW-PTP LMWPTP PPAC_HUMAN low molecular weight phosphotyrosine protein phosphatase isoform c
Type:
Mol. Mass.:
18042.81
Organism:
Homo sapiens (Human)
Description:
P24666
Residue:
158
  
Inhibitor
Name:
BDBM50188777
Synonyms:
CHEMBL213452 | ammonium N-[4-(2-{[(benzyloxy)carbonyl]amino}-3-ethoxy-2-(methoxycarbonyl)-3-oxopropyl)phenyl]sulfamate
Type:
Small organic molecule
Emp. Form.:
C21H23N2O9S
Mol. Mass.:
479.481
SMILES:
CCOC(=O)C(Cc1ccc(NS([O-])(=O)=O)cc1)(NC(=O)OCc1ccccc1)C(=O)OC
: