Target
Tyrosine-protein phosphatase non-receptor type 1
Ligand
BDBM50188779
Substrate
Meas. Tech.
ChEMBL_389276 (CHEMBL868026)
IC50
16200±n/a nM
Citation
 Amarasinghe, KKEvdokimov, AGEvidokimov, AGXu, KClark, CMMaier, MBSrivastava, AColson, AOGerwe, GSStake, GEHoward, BWPokross, MEGray, JLPeters, KG Design and synthesis of potent, non-peptidic inhibitors of HPTPbeta. Bioorg Med Chem Lett 16:4252-6 (2006)  
Target
Name:
Tyrosine-protein phosphatase non-receptor type 1
Synonyms:
PTN1_HUMAN PTPN1 Protein tyrosine phosphatase-1B (PTP1B) Protein-tyrosine phosphatase 1B (PTP1B) Tyrosine-protein phosphatase non-receptor type 1 (PTP1B)
Type:
Protein phosphatase
Mol. Mass.:
49963.76
Organism:
Homo sapiens (Human)
Description:
Human recombinant GST-fusion PTP1B (1-435).
Residue:
435
  
Inhibitor
Name:
BDBM50188779
Synonyms:
CHEMBL378423 | ammonium N-{4-[4-ethoxy-2,2-bis(methoxycarbonyl)-4-oxobutyl]phenyl}sulfamate
Type:
Small organic molecule
Emp. Form.:
C16H20NO9S
Mol. Mass.:
402.397
SMILES:
CCOC(=O)CC(Cc1ccc(NS([O-])(=O)=O)cc1)(C(=O)OC)C(=O)OC
: