Target
Tyrosine-protein phosphatase non-receptor type 2
Ligand
BDBM50188777
Substrate
Meas. Tech.
ChEMBL_389285 (CHEMBL868041)
IC50
78000±n/a nM
Citation
 Amarasinghe, KKEvdokimov, AGEvidokimov, AGXu, KClark, CMMaier, MBSrivastava, AColson, AOGerwe, GSStake, GEHoward, BWPokross, MEGray, JLPeters, KG Design and synthesis of potent, non-peptidic inhibitors of HPTPbeta. Bioorg Med Chem Lett 16:4252-6 (2006)  
Target
Name:
Tyrosine-protein phosphatase non-receptor type 2
Synonyms:
PTN2_HUMAN PTPT T-cell protein-tyrosine phosphatase TCPTP Tyrosine-protein phosphatase non-receptor type 2 (TC-PTP)
Type:
Protein
Mol. Mass.:
48481.80
Organism:
Homo sapiens (Human)
Description:
P17706
Residue:
415
  
Inhibitor
Name:
BDBM50188777
Synonyms:
CHEMBL213452 | ammonium N-[4-(2-{[(benzyloxy)carbonyl]amino}-3-ethoxy-2-(methoxycarbonyl)-3-oxopropyl)phenyl]sulfamate
Type:
Small organic molecule
Emp. Form.:
C21H23N2O9S
Mol. Mass.:
479.481
SMILES:
CCOC(=O)C(Cc1ccc(NS([O-])(=O)=O)cc1)(NC(=O)OCc1ccccc1)C(=O)OC
: